Target
Alpha-1D adrenergic receptor
Ligand
BDBM50203480
Substrate
Meas. Tech.
ChEMBL_441869 (CHEMBL891020)
Ki
0.5±n/a nM
Citation
 Li, SChiu, GPulito, VLLiu, JConnolly, PJMiddleton, SA 1-Arylpiperazinyl-4-cyclohexylamine derived isoindole-1,3-diones as potent and selective alpha-1a/1d adrenergic receptor ligands. Bioorg Med Chem Lett 17:1646-50 (2007)  
Target
Name:
Alpha-1D adrenergic receptor
Synonyms:
ADA1D_HUMAN ADRA1D Adrenergic receptor alpha Alpha 1D-adrenoreceptor Alpha-1D adrenoceptor adrenergic Alpha1D
Type:
Enzyme Catalytic Domain
Mol. Mass.:
60485.82
Organism:
Homo sapiens (Human)
Description:
adrenergic Alpha1D ADRA1D HUMAN::P25100
Residue:
572
  
Inhibitor
Name:
BDBM50203480
Synonyms:
8-fluoro-2-(4-(4-(2-isopropoxyphenyl)piperazin-1-yl)cyclohexyl)-2H-benzo[e]isoindole-1,3-dione | CHEMBL243866
Type:
Small organic molecule
Emp. Form.:
C31H34FN3O3
Mol. Mass.:
515.6184
SMILES:
CC(C)Oc1ccccc1N1CCN(CC1)C1CCC(CC1)N1C(=O)c2ccc3ccc(F)cc3c2C1=O
: