Target
Alpha-1B adrenergic receptor
Ligand
BDBM82517
Substrate
Meas. Tech.
ChEMBL_441868 (CHEMBL891019)
Ki
0.96±n/a nM
Citation
 Li, SChiu, GPulito, VLLiu, JConnolly, PJMiddleton, SA 1-Arylpiperazinyl-4-cyclohexylamine derived isoindole-1,3-diones as potent and selective alpha-1a/1d adrenergic receptor ligands. Bioorg Med Chem Lett 17:1646-50 (2007)  
Target
Name:
Alpha-1B adrenergic receptor
Synonyms:
ADA1B_HUMAN Adrenergic alpha1B Adrenergic receptor alpha Alpha 1B-adrenoreceptor | Alpha-1B adrenergic receptor
Type:
Enzyme
Mol. Mass.:
56862.13
Organism:
Homo sapiens (Human)
Description:
P35368
Residue:
520
  
Inhibitor
Name:
BDBM82517
Synonyms:
2-{4-[4-(2-Methoxy-phenyl)-piperazin-1-yl]-butyl}-isoindole-1,3-dione CHEMBL126632 NAN-190 | NSC_107966
Type:
Small organic molecule
Emp. Form.:
C23H27N3O3
Mol. Mass.:
393.4788
SMILES:
COc1ccccc1N1CCN(CCCCN2C(=O)c3ccccc3C2=O)CC1
: