Target
Potassium voltage-gated channel subfamily H member 2
Ligand
BDBM50203567
Substrate
Meas. Tech.
ChEMBL_454227 (CHEMBL903410)
Ki
98±n/a nM
Citation
 Lowe, JDrozda, SQian, WPeakman, MCLiu, JGibbs, JHarms, JSchmidt, CFisher, KStrick, CSchmidt, AVanase, MLebel, L A novel, non-substrate-based series of glycine type 1 transporter inhibitors derived from high-throughput screening. Bioorg Med Chem Lett 17:1675-8 (2007)  
Target
Name:
Potassium voltage-gated channel subfamily H member 2
Synonyms:
1,3-beta-glucan synthase component GLS2 ERG Eag-related protein 1 Ether-a-go-go-related gene (HERG) Ether-a-go-go-related gene potassium channel 1 Ether-a-go-go-related gene potassium channel 1 (hERG1) Ether-a-go-go-related protein 1 H-ERG KCNH2 Potassium voltage-gated channel subfamily H member 2 (hERG) Voltage-gated potassium channel subunit Kv11.1 hERG Potassium Channel 1 | putative potassium channel subunit
Type:
Multi-pass membrane protein
Mol. Mass.:
126672.65
Organism:
Homo sapiens (Human)
Description:
Q12809
Residue:
1159
  
Inhibitor
Name:
BDBM50203567
Synonyms:
1-(6-((5-(4-chlorophenyl)-1,2,4-oxadiazol-3-yl)methoxy)-2,3-dihydro-1H-inden-1-yl)-4-isopropylpiperazine | CHEMBL239596
Type:
Small organic molecule
Emp. Form.:
C25H29ClN4O2
Mol. Mass.:
452.976
SMILES:
CC(C)N1CCN(CC1)C1CCc2ccc(OCc3noc(n3)-c3ccc(Cl)cc3)cc12
: