Target
C-C chemokine receptor type 8
Ligand
BDBM50203878
Substrate
Meas. Tech.
ChEMBL_425772 (CHEMBL855762)
Ki
5.4±n/a nM
Citation
 Jenkins, TJGuan, BDai, MLi, GLightburn, TEHuang, SFreeze, BSBurdi, DFJacutin-Porte, SBennett, RChen, WMinor, CGhosh, SBlackburn, CGigstad, KMJones, MKolbeck, RYin, WSmith, SCardillo, DOcain, TDHarriman, GC Design, synthesis, and evaluation of naphthalene-sulfonamide antagonists of human CCR8. J Med Chem 50:566-84 (2007)  
Target
Name:
C-C chemokine receptor type 8
Synonyms:
CCR8 CKRL1 CMKBRL2
Type:
PROTEIN
Mol. Mass.:
40855.53
Organism:
Homo sapiens (Human)
Description:
ChEMBL_454278
Residue:
355
  
Inhibitor
Name:
BDBM50203878
Synonyms:
CHEMBL218036 | N-{4-[1-(2-hydroxy-acetyl)-piperidin-4-ylsulfamoyl]-naphthalen-1-yl}-2-methyl-benzamide
Type:
Small organic molecule
Emp. Form.:
C25H27N3O5S
Mol. Mass.:
481.564
SMILES:
Cc1ccccc1C(=O)Nc1ccc(c2ccccc12)S(=O)(=O)NC1CCN(CC1)C(=O)CO
: