Target
Sodium-dependent dopamine transporter
Ligand
BDBM50203933
Substrate
Meas. Tech.
ChEMBL_454295 (CHEMBL903473)
IC50
>4000±n/a nM
Citation
 Fish, PVFray, MJStobie, AWakenhut, FWhitlock, GA N-Benzyl-N-(tetrahydro-2H-pyran-4-yl)pyrrolidin-3-amines as selective dual serotonin/noradrenaline reuptake inhibitors. Bioorg Med Chem Lett 17:2022-5 (2007)  
Target
Name:
Sodium-dependent dopamine transporter
Synonyms:
DA transporter DAT1 Dopamine transporter protein (DAT) SC6A3_HUMAN Sodium-dependent dopamine transporter Solute carrier family 6 member 3
Type:
Multi-pass membrane protein
Mol. Mass.:
68497.11
Organism:
Homo sapiens (Human)
Description:
Q01959
Residue:
620
  
Inhibitor
Name:
BDBM50203933
Synonyms:
(S)-N-(3-fluoro-2-(trifluoromethyl)benzyl)-N-(tetrahydro-2H-pyran-4-yl)pyrrolidin-3-amine | CHEMBL245492
Type:
Small organic molecule
Emp. Form.:
C17H22F4N2O
Mol. Mass.:
346.363
SMILES:
Fc1cccc(CN([C@H]2CCNC2)C2CCOCC2)c1C(F)(F)F
: