Target
Potassium voltage-gated channel subfamily H member 2
Ligand
BDBM50203933
Substrate
Meas. Tech.
ChEMBL_454299 (CHEMBL903477)
IC50
1600±n/a nM
Citation
 Fish, PVFray, MJStobie, AWakenhut, FWhitlock, GA N-Benzyl-N-(tetrahydro-2H-pyran-4-yl)pyrrolidin-3-amines as selective dual serotonin/noradrenaline reuptake inhibitors. Bioorg Med Chem Lett 17:2022-5 (2007)  
Target
Name:
Potassium voltage-gated channel subfamily H member 2
Synonyms:
1,3-beta-glucan synthase component GLS2 ERG Eag-related protein 1 Ether-a-go-go-related gene (HERG) Ether-a-go-go-related gene potassium channel 1 Ether-a-go-go-related gene potassium channel 1 (hERG1) Ether-a-go-go-related protein 1 H-ERG KCNH2 Potassium voltage-gated channel subfamily H member 2 (hERG) Voltage-gated potassium channel subunit Kv11.1 hERG Potassium Channel 1 | putative potassium channel subunit
Type:
Multi-pass membrane protein
Mol. Mass.:
126672.65
Organism:
Homo sapiens (Human)
Description:
Q12809
Residue:
1159
  
Inhibitor
Name:
BDBM50203933
Synonyms:
(S)-N-(3-fluoro-2-(trifluoromethyl)benzyl)-N-(tetrahydro-2H-pyran-4-yl)pyrrolidin-3-amine | CHEMBL245492
Type:
Small organic molecule
Emp. Form.:
C17H22F4N2O
Mol. Mass.:
346.363
SMILES:
Fc1cccc(CN([C@H]2CCNC2)C2CCOCC2)c1C(F)(F)F
: