Target
Sodium-dependent serotonin transporter
Ligand
BDBM50203947
Substrate
Meas. Tech.
ChEMBL_454293 (CHEMBL902422)
IC50
29±n/a nM
Citation
 Fish, PVFray, MJStobie, AWakenhut, FWhitlock, GA N-Benzyl-N-(tetrahydro-2H-pyran-4-yl)pyrrolidin-3-amines as selective dual serotonin/noradrenaline reuptake inhibitors. Bioorg Med Chem Lett 17:2022-5 (2007)  
Target
Name:
Sodium-dependent serotonin transporter
Synonyms:
5-HT Transporter 5HTT SC6A4_HUMAN SLC6A4 Serotonin transporter (5HTT) Sodium-dependent serotonin transporter (SERT) | Solute carrier family 6 member 4
Type:
Multi-pass membrane protein
Mol. Mass.:
70322.51
Organism:
Homo sapiens (Human)
Description:
P31645
Residue:
630
  
Inhibitor
Name:
BDBM50203947
Synonyms:
(2-methyl-benzyl)-(S)-pyrrolidin-3-yl-(tetrahydro-pyran-4-yl)-amine | CHEMBL397392
Type:
Small organic molecule
Emp. Form.:
C17H26N2O
Mol. Mass.:
274.4011
SMILES:
Cc1ccccc1CN([C@H]1CCNC1)C1CCOCC1
: