Target
Polyphenol oxidase 2
Ligand
BDBM50203986
Substrate
Meas. Tech.
ChEMBL_441976 (CHEMBL891120)
Ki
3100±n/a nM
Citation
 Jun, NHong, GJun, K Synthesis and evaluation of 2',4',6'-trihydroxychalcones as a new class of tyrosinase inhibitors. Bioorg Med Chem 15:2396-402 (2007)  
Target
Name:
Polyphenol oxidase 2
Synonyms:
Monophenol monooxygenase PPO2 Tyrosinase
Type:
Protein
Mol. Mass.:
63923.66
Organism:
Agaricus bisporus (Common mushroom)
Description:
O42713
Residue:
556
  
Inhibitor
Name:
BDBM50203986
Synonyms:
2,2',4,4',6'-pentahydroxychalcone | CHEMBL244249
Type:
Small organic molecule
Emp. Form.:
C15H12O6
Mol. Mass.:
288.2522
SMILES:
Oc1ccc(\C=C\C(=O)c2c(O)cc(O)cc2O)c(O)c1
: