Target
Serine/threonine-protein kinase Chk1
Ligand
BDBM50204717
Substrate
Meas. Tech.
ChEMBL_442099 (CHEMBL891237)
IC50
1880±n/a nM
Citation
 Tong, YClaiborne, AStewart, KDPark, CKovar, PChen, ZCredo, RBGu, WZGwaltney, SLJudge, RAZhang, HRosenberg, SHSham, HLSowin, TJLin, NH Discovery of 1,4-dihydroindeno[1,2-c]pyrazoles as a novel class of potent and selective checkpoint kinase 1 inhibitors. Bioorg Med Chem 15:2759-67 (2007)  
Target
Name:
Serine/threonine-protein kinase Chk1
Synonyms:
CHEK1 CHK1 checkpoint homolog Checkpoint kinase-1 (CHK1)
Type:
Enzyme Catalytic Domain
Mol. Mass.:
54443.02
Organism:
Homo sapiens (Human)
Description:
gi_166295192
Residue:
476
  
Inhibitor
Name:
BDBM50204717
Synonyms:
2-(4-(6-(((1s,4s)-4-methylcyclohexylamino)methyl)-1,4-dihydroindeno[1,2-c]pyrazol-3-yl)phenyl)acetonitrile | CHEMBL242324
Type:
Small organic molecule
Emp. Form.:
C26H28N4
Mol. Mass.:
396.5273
SMILES:
C[C@H]1CC[C@H](CC1)NCc1ccc-2c(Cc3c(n[nH]c-23)-c2ccc(CC#N)cc2)c1
: