Target
Protein kinase C gamma type
Ligand
BDBM50204693
Substrate
Meas. Tech.
ChEMBL_442108 (CHEMBL891246)
IC50
4900±n/a nM
Citation
 Tong, YClaiborne, AStewart, KDPark, CKovar, PChen, ZCredo, RBGu, WZGwaltney, SLJudge, RAZhang, HRosenberg, SHSham, HLSowin, TJLin, NH Discovery of 1,4-dihydroindeno[1,2-c]pyrazoles as a novel class of potent and selective checkpoint kinase 1 inhibitors. Bioorg Med Chem 15:2759-67 (2007)  
Target
Name:
Protein kinase C gamma type
Synonyms:
KPCG_HUMAN PKC-gamma PRKCG Protein kinase C gamma type Protein kinase C, gamma
Type:
Enzyme
Mol. Mass.:
78458.05
Organism:
Homo sapiens (Human)
Description:
The recombinant human PKC enzymes were produced using a baculovirus expression system in SF9 cells
Residue:
697
  
Inhibitor
Name:
BDBM50204693
Synonyms:
3-(4'-hydroxy-biphenyl-4-yl)-1,4-dihydro-indeno[1,2-c]pyrazole-6-carboxylic acid (pyridin-4-ylmethyl)-amide | CHEMBL242753
Type:
Small organic molecule
Emp. Form.:
C29H22N4O2
Mol. Mass.:
458.5106
SMILES:
Oc1ccc(cc1)-c1ccc(cc1)-c1n[nH]c-2c1Cc1cc(ccc-21)C(=O)NCc1ccncc1
: