Target
Peroxisome proliferator-activated receptor alpha
Ligand
BDBM50085044
Substrate
Meas. Tech.
ChEMBL_454551 (CHEMBL886578)
EC50
321±n/a nM
Citation
 Devasthale, PVChen, SJeon, YQu, FRyono, DEWang, WZhang, HCheng, LFarrelly, DGolla, RGrover, GMa, ZMoore, LSeethala, RSun, WDoweyko, AMChandrasena, GSleph, PHariharan, NCheng, PT Discovery of tertiary aminoacids as dual PPARalpha/gamma agonists-I. Bioorg Med Chem Lett 17:2312-6 (2007)  
Target
Name:
Peroxisome proliferator-activated receptor alpha
Synonyms:
NR1C1 PPAR PPAR-alpha PPARA_HUMAN Peroxisome proliferator-activated receptor | Peroxisome proliferator-activated receptor alpha (PPAR alpha)
Type:
Enzyme
Mol. Mass.:
52222.08
Organism:
Homo sapiens (Human)
Description:
Q07869
Residue:
468
  
Inhibitor
Name:
BDBM50085044
Synonyms:
(S)-2-(2-Benzoyl-phenylamino)-3-{4-[2-(5-methyl-2-phenyl-oxazol-4-yl)-ethoxy]-phenyl}-propionic acid 2-(2-BENZOYL-PHENYLAMINO)-3-{4-[2-(5-METHYL-2-PHENYL-OXAZOL-4-YL)-ETHOXY]-PHENYL}-PROPIONIC ACID CHEMBL107367 | Farglitazar
Type:
Small organic molecule
Emp. Form.:
C34H30N2O5
Mol. Mass.:
546.6124
SMILES:
Cc1oc(nc1CCOc1ccc(C[C@H](Nc2ccccc2C(=O)c2ccccc2)C(O)=O)cc1)-c1ccccc1
: