Target
C-C chemokine receptor type 5
Ligand
BDBM50205736
Substrate
Meas. Tech.
ChEMBL_428416 (CHEMBL919486)
EC50
3000±n/a nM
Citation
 Kellenberger, ESpringael, JYParmentier, MHachet-Haas, MGalzi, JLRognan, D Identification of nonpeptide CCR5 receptor agonists by structure-based virtual screening. J Med Chem 50:1294-303 (2007)  
Target
Name:
C-C chemokine receptor type 5
Synonyms:
C-C CKR-5 CC-CKR-5 CCR5 CCR5_HUMAN CHEMR13 HIV-1 fusion coreceptor
Type:
Enzyme
Mol. Mass.:
40540.21
Organism:
Homo sapiens (Human)
Description:
P51681
Residue:
352
  
Inhibitor
Name:
BDBM50205736
Synonyms:
2-(4-benzyl-5-(2-(piperidin-1-yl)ethyl)-4H-1,2,4-triazol-3-ylthio)-N-(2,4-dimethylphenyl)acetamide | CHEMBL219781
Type:
Small organic molecule
Emp. Form.:
C26H33N5OS
Mol. Mass.:
463.638
SMILES:
Cc1ccc(NC(=O)CSc2nnc(CCN3CCCCC3)n2Cc2ccccc2)c(C)c1
: