Target
Melanocortin receptor 3
Ligand
BDBM50205745
Substrate
Meas. Tech.
ChEMBL_442413 (CHEMBL892575)
EC50
1.9±n/a nM
Citation
 Ballet, SMayorov, AVCai, MTymecka, DChandler, KBPalmer, ESRompaey, KVMisicka, ATourwé, DHruby, VJ Novel selective human melanocortin-3 receptor ligands: use of the 4-amino-1,2,4,5-tetrahydro-2-benzazepin-3-one (Aba) scaffold. Bioorg Med Chem Lett 17:2492-8 (2007)  
Target
Name:
Melanocortin receptor 3
Synonyms:
MC3-R MC3R_HUMAN Melanocortin receptor (M3 and M4)
Type:
Enzyme
Mol. Mass.:
36044.86
Organism:
Homo sapiens (Human)
Description:
P41968
Residue:
323
  
Inhibitor
Name:
BDBM50205745
Synonyms:
(3S,6S,9R,12S,15S,23S)-15-[(2S)-2-aminohexanamido]-6-(3-carbamimidamidopropyl)-12-(1H-imidazol-5-ylmethyl)-3-(1H-indol-3-ylmethyl)-9-(naphthalen-2-ylmethyl)-2,5,8,11,14,17-hexaoxo-1,4,7,10,13,18-hexaazacyclotricosane-23-carboxamide | CHEMBL393075
Type:
Small organic molecule
Emp. Form.:
C52H69N15O8
Mol. Mass.:
1032.2
SMILES:
CCCC[C@H](N)C(=O)N[C@H]1CC(=O)NCCCC[C@H](NC(=O)[C@H](Cc2c[nH]c3ccccc23)NC(=O)[C@H](CCCN=C(N)N)NC(=O)[C@@H](Cc2ccc3ccccc3c2)NC(=O)[C@H](Cc2cnc[nH]2)NC1=O)C(N)=O
: