Target
5-hydroxytryptamine receptor 2C
Ligand
BDBM50001915
Substrate
Meas. Tech.
ChEMBL_428466 (CHEMBL918967)
Ki
17±n/a nM
Citation
 Wacker, DAVarnes, JGMalmstrom, SECao, XHung, CPUng, TWu, GZhang, GZuvich, EThomas, MAKeim, WJCullen, MJRohrbach, KWQu, QNarayanan, RRossi, KJanovitz, ELehman-McKeeman, LMalley, MFDevenny, JPelleymounter, MAMiller, KJRobl, JA Discovery of (R)-9-ethyl-1,3,4,10b-tetrahydro-7-trifluoromethylpyrazino[2,1-a]isoindol- 6(2H)-one, a selective, orally active agonist of the 5-HT(2C) receptor. J Med Chem 50:1365-79 (2007)  
Target
Name:
5-hydroxytryptamine receptor 2C
Synonyms:
5-HT-2C 5-HT2C-INI 5-HTR2C 5-hydroxytryptamine receptor 2C (5-HT-2C) 5HT-1C HTR1C Serotonin (5-HT3) receptor Serotonin Receptor 2C
Type:
G Protein-Coupled Receptor (GPCR)
Mol. Mass.:
51836.79
Organism:
Homo sapiens (Human)
Description:
P28335
Residue:
458
  
Inhibitor
Name:
BDBM50001915
Synonyms:
1-(3-chlorophenyl)piperazine m-Chlorophenylpiperazine | mCPP
Type:
Small organic molecule
Emp. Form.:
C10H13ClN2
Mol. Mass.:
196.677
SMILES:
Clc1cccc(c1)N1CCNCC1
: