Target
5-hydroxytryptamine receptor 2B
Ligand
BDBM50205880
Substrate
Meas. Tech.
ChEMBL_428465 (CHEMBL918966)
Ki
220±n/a nM
Citation
 Wacker, DAVarnes, JGMalmstrom, SECao, XHung, CPUng, TWu, GZhang, GZuvich, EThomas, MAKeim, WJCullen, MJRohrbach, KWQu, QNarayanan, RRossi, KJanovitz, ELehman-McKeeman, LMalley, MFDevenny, JPelleymounter, MAMiller, KJRobl, JA Discovery of (R)-9-ethyl-1,3,4,10b-tetrahydro-7-trifluoromethylpyrazino[2,1-a]isoindol- 6(2H)-one, a selective, orally active agonist of the 5-HT(2C) receptor. J Med Chem 50:1365-79 (2007)  
Target
Name:
5-hydroxytryptamine receptor 2B
Synonyms:
5-HT-2B 5-hydroxytryptamine (serotonin) receptor 2B [Homo sapiens] 5-hydroxytryptamine receptor 2C (5HT2C) HTR2B Serotonin 2b (5-HT2b) receptor | Serotonin Receptor 2B
Type:
G Protein-Coupled Receptor (GPCR)
Mol. Mass.:
54312.47
Organism:
Homo sapiens (Human)
Description:
Receptor binding assays were performed using human clone stably expressed in CHO cells.
Residue:
481
  
Inhibitor
Name:
BDBM50205880
Synonyms:
(R)-9-butyl-1,3,4,10b-tetrahydro-7-trifluoromethylpyrazino-[2,1-a]isoindol-6(2H)-one | CHEMBL373483
Type:
Small organic molecule
Emp. Form.:
C16H19F3N2O
Mol. Mass.:
312.3301
SMILES:
CCCCc1cc2[C@@H]3CNCCN3C(=O)c2c(c1)C(F)(F)F
: