Target
Nitric oxide synthase, inducible
Ligand
BDBM50205949
Substrate
Meas. Tech.
ChEMBL_428500 (CHEMBL920402)
IC50
77±n/a nM
Citation
 Davey, DDAdler, MArnaiz, DEagen, KErickson, SGuilford, WKenrick, MMorrissey, MMOhlmeyer, MPan, GParadkar, VMParkinson, JPolokoff, MSaionz, KSantos, CSubramanyam, BVergona, RWei, RGWhitlow, MYe, BZhao, ZSDevlin, JJPhillips, G Design, synthesis, and activity of 2-imidazol-1-ylpyrimidine derived inducible nitric oxide synthase dimerization inhibitors. J Med Chem 50:1146-57 (2007)  
Target
Name:
Nitric oxide synthase, inducible
Synonyms:
HEP-NOS Inducible NO synthase NOS type II NOS2A Nitric oxide synthase, inducible (iNOS) | iNOS
Type:
Homodimer
Mol. Mass.:
131141.95
Organism:
Homo sapiens (Human)
Description:
P35228
Residue:
1153
  
Inhibitor
Name:
BDBM50205949
Synonyms:
CHEMBL220213 | N-(1,3-benzodioxol-5-ylmethyl)-1-[3-(1H-imidazol-1-yl)phenyl]-2-piperidineacetamide
Type:
Small organic molecule
Emp. Form.:
C24H26N4O3
Mol. Mass.:
418.4882
SMILES:
O=C(CC1CCCCN1c1cccc(c1)-n1ccnc1)NCc1ccc2OCOc2c1
: