Target
Lutropin-choriogonadotropic hormone receptor
Ligand
BDBM50206401
Substrate
Meas. Tech.
ChEMBL_454739 (CHEMBL886762)
EC50
20±n/a nM
Citation
 Jorand-Lebrun, CBrondyk, BLin, JMagar, SMurray, RReddy, AShroff, HWands, GWeiser, WXu, QMcKenna, SBrugger, N Identification, synthesis, and biological evaluation of novel pyrazoles as low molecular weight luteinizing hormone receptor agonists. Bioorg Med Chem Lett 17:2080-5 (2007)  
Target
Name:
Lutropin-choriogonadotropic hormone receptor
Synonyms:
LCGR LH/CG-R LHR LSH-R Luteinizing hormone receptor
Type:
PROTEIN
Mol. Mass.:
78662.77
Organism:
Homo sapiens (Human)
Description:
ChEMBL_562598
Residue:
699
  
Inhibitor
Name:
BDBM50206401
Synonyms:
CHEMBL246321 | N-((S)-1-amino-3-(4-hydroxyphenyl)-1-oxopropan-2-yl)-5-(1-(4-tert-butylphenyl)-3-(pyridin-3-yl)-1H-pyrazol-5-yl)pentanamide
Type:
Small organic molecule
Emp. Form.:
C32H37N5O3
Mol. Mass.:
539.6679
SMILES:
CC(C)(C)c1ccc(cc1)-n1nc(cc1CCCCC(=O)N[C@@H](Cc1ccc(O)cc1)C(N)=O)-c1cccnc1
: