Target
M1 family aminopeptidase
Ligand
BDBM50197503
Substrate
Meas. Tech.
ChEMBL_428661 (CHEMBL915808)
IC50
45±n/a nM
Citation
 Flipo, MBeghyn, TLeroux, VFlorent, IDeprez, BPDeprez-Poulain, RF Novel selective inhibitors of the zinc plasmodial aminopeptidase PfA-M1 as potential antimalarial agents. J Med Chem 50:1322-34 (2007)  
Target
Name:
M1 family aminopeptidase
Synonyms:
AMPN_PLAF7 Zinc aminopeptidase | m1-family aminopeptidase
Type:
PROTEIN
Mol. Mass.:
126072.31
Organism:
Plasmodium falciparum (isolate FcB1 / Columbia)
Description:
ChEMBL_735637
Residue:
1085
  
Inhibitor
Name:
BDBM50197503
Synonyms:
CHEMBL425291 N1-(3-phenoxybenzyl)-N3-hydroxy-2-isobutylmalonamide
Type:
Small organic molecule
Emp. Form.:
C20H24N2O4
Mol. Mass.:
356.4156
SMILES:
CC(C)CC(C(=O)NO)C(=O)NCc1cccc(Oc2ccccc2)c1
: