Target
Muscarinic acetylcholine receptor M3
Ligand
BDBM50207989
Substrate
Meas. Tech.
ChEMBL_429171 (CHEMBL914427)
Ki
83.7±n/a nM
Citation
 Peretto, IForlani, RFossati, CGiardina, GAGiardini, AGuala, MLa Porta, EPetrillo, PRadaelli, SRadice, LRaveglia, LFSantoro, EScudellaro, RScarpitta, FBigogno, CMisiano, PDondio, GMRizzi, AArmani, EAmari, GCivelli, MVilletti, GPatacchini, RBergamaschi, MDelcanale, MSalcedo, CFernández, AGImbimbo, BP Discovery of diaryl imidazolidin-2-one derivatives, a novel class of muscarinic M3 selective antagonists (Part 1). J Med Chem 50:1571-83 (2007)  
Target
Name:
Muscarinic acetylcholine receptor M3
Synonyms:
ACM3_HUMAN Cholinergic, muscarinic M3 Muscarinic receptor M3 | RecName: Full=Muscarinic acetylcholine receptor M3
Type:
Enzyme
Mol. Mass.:
66151.03
Organism:
Homo sapiens (Human)
Description:
P20309
Residue:
590
  
Inhibitor
Name:
BDBM50207989
Synonyms:
3-(1-(2-methoxybenzyl)-piperidin-4-yl)-5,5-diphenyl-imidazolidin-2-one | CHEMBL388541
Type:
Small organic molecule
Emp. Form.:
C28H31N3O2
Mol. Mass.:
441.5646
SMILES:
COc1ccccc1CN1CCC(CC1)N1CC(NC1=O)(c1ccccc1)c1ccccc1
: