Target
Muscarinic acetylcholine receptor M2
Ligand
BDBM50207990
Substrate
Meas. Tech.
ChEMBL_429169 (CHEMBL914425)
Ki
187±n/a nM
Citation
 Peretto, IForlani, RFossati, CGiardina, GAGiardini, AGuala, MLa Porta, EPetrillo, PRadaelli, SRadice, LRaveglia, LFSantoro, EScudellaro, RScarpitta, FBigogno, CMisiano, PDondio, GMRizzi, AArmani, EAmari, GCivelli, MVilletti, GPatacchini, RBergamaschi, MDelcanale, MSalcedo, CFernández, AGImbimbo, BP Discovery of diaryl imidazolidin-2-one derivatives, a novel class of muscarinic M3 selective antagonists (Part 1). J Med Chem 50:1571-83 (2007)  
Target
Name:
Muscarinic acetylcholine receptor M2
Synonyms:
ACM2_HUMAN Cholinergic, muscarinic M2 Muscarinic acetylcholine receptor M2 and M5 | RecName: Full=Muscarinic acetylcholine receptor M2
Type:
GPCR
Mol. Mass.:
51730.61
Organism:
Homo sapiens (Human)
Description:
P08172
Residue:
466
  
Inhibitor
Name:
BDBM50207990
Synonyms:
3-(1-(3-fluorobenzyl)-piperidin-4-yl)-5,5-di-(2-thienyl)-imidazolidin-2-one | CHEMBL376781
Type:
Small organic molecule
Emp. Form.:
C23H24FN3OS2
Mol. Mass.:
441.585
SMILES:
Fc1cccc(CN2CCC(CC2)N2CC(NC2=O)(c2cccs2)c2cccs2)c1
: