Target
Cytochrome P450 2D6
Ligand
BDBM50208006
Substrate
Meas. Tech.
ChEMBL_429178 (CHEMBL913813)
IC50
12000±n/a nM
Citation
 Peretto, IForlani, RFossati, CGiardina, GAGiardini, AGuala, MLa Porta, EPetrillo, PRadaelli, SRadice, LRaveglia, LFSantoro, EScudellaro, RScarpitta, FBigogno, CMisiano, PDondio, GMRizzi, AArmani, EAmari, GCivelli, MVilletti, GPatacchini, RBergamaschi, MDelcanale, MSalcedo, CFernández, AGImbimbo, BP Discovery of diaryl imidazolidin-2-one derivatives, a novel class of muscarinic M3 selective antagonists (Part 1). J Med Chem 50:1571-83 (2007)  
Target
Name:
Cytochrome P450 2D6
Synonyms:
CP2D6_HUMAN CYP2DL1 Cytochrome P450 2D6 (CYP2D6) P450-DB1
Type:
Protein
Mol. Mass.:
55774.82
Organism:
Homo sapiens (Human)
Description:
P10635
Residue:
497
  
Inhibitor
Name:
BDBM50208006
Synonyms:
3-(1-(3-fluorobenzyl)-piperidin-4-yl)-5,5-di-(4-fluorophenyl)-imidazolidin-2-one | CHEMBL221401
Type:
Small organic molecule
Emp. Form.:
C27H26F3N3O
Mol. Mass.:
465.51
SMILES:
Fc1ccc(cc1)C1(CN(C2CCN(Cc3cccc(F)c3)CC2)C(=O)N1)c1ccc(F)cc1
: