Target
Muscarinic acetylcholine receptor M2
Ligand
BDBM50208007
Substrate
Meas. Tech.
ChEMBL_429169 (CHEMBL914425)
Ki
955±n/a nM
Citation
 Peretto, IForlani, RFossati, CGiardina, GAGiardini, AGuala, MLa Porta, EPetrillo, PRadaelli, SRadice, LRaveglia, LFSantoro, EScudellaro, RScarpitta, FBigogno, CMisiano, PDondio, GMRizzi, AArmani, EAmari, GCivelli, MVilletti, GPatacchini, RBergamaschi, MDelcanale, MSalcedo, CFernández, AGImbimbo, BP Discovery of diaryl imidazolidin-2-one derivatives, a novel class of muscarinic M3 selective antagonists (Part 1). J Med Chem 50:1571-83 (2007)  
Target
Name:
Muscarinic acetylcholine receptor M2
Synonyms:
ACM2_HUMAN Cholinergic, muscarinic M2 Muscarinic acetylcholine receptor M2 and M5 | RecName: Full=Muscarinic acetylcholine receptor M2
Type:
GPCR
Mol. Mass.:
51730.61
Organism:
Homo sapiens (Human)
Description:
P08172
Residue:
466
  
Inhibitor
Name:
BDBM50208007
Synonyms:
3-(1-(3-chlorobenzyl)-piperidin-4-yl)-5,5-di-(4-fluorophenyl)-imidazolidin-2-one | CHEMBL223079
Type:
Small organic molecule
Emp. Form.:
C27H26ClF2N3O
Mol. Mass.:
481.965
SMILES:
Fc1ccc(cc1)C1(CN(C2CCN(Cc3cccc(Cl)c3)CC2)C(=O)N1)c1ccc(F)cc1
: