Target
Muscarinic acetylcholine receptor M3
Ligand
BDBM50208032
Substrate
Meas. Tech.
ChEMBL_429188 (CHEMBL913822)
Ki
335±n/a nM
Citation
 Peretto, IFossati, CGiardina, GAGiardini, AGuala, MLa Porta, EPetrillo, PRadaelli, SRadice, LRaveglia, LFSantoro, EScudellaro, RScarpitta, FCerri, AMenegon, SDondio, GMRizzi, AArmani, EAmari, GCivelli, MVilletti, GPatacchini, RBergamaschi, MBassani, FDelcanale, MImbimbo, BP Discovery of diaryl imidazolidin-2-one derivatives, a novel class of muscarinic M3 selective antagonists (Part 2). J Med Chem 50:1693-7 (2007)  
Target
Name:
Muscarinic acetylcholine receptor M3
Synonyms:
ACM3_HUMAN Cholinergic, muscarinic M3 Muscarinic receptor M3 | RecName: Full=Muscarinic acetylcholine receptor M3
Type:
Enzyme
Mol. Mass.:
66151.03
Organism:
Homo sapiens (Human)
Description:
P20309
Residue:
590
  
Inhibitor
Name:
BDBM50208032
Synonyms:
CHEMBL224784 | trimethyl-[2-(2-oxo-4,4-diphenyl-imidazolidin-1-yl)-ethyl]-ammonium
Type:
Small organic molecule
Emp. Form.:
C20H26N3O
Mol. Mass.:
324.4394
SMILES:
C[N+](C)(C)CCN1CC(NC1=O)(c1ccccc1)c1ccccc1
: