Target
Muscarinic acetylcholine receptor M3
Ligand
BDBM50208051
Substrate
Meas. Tech.
ChEMBL_429188 (CHEMBL913822)
Ki
1.84±n/a nM
Citation
 Peretto, IFossati, CGiardina, GAGiardini, AGuala, MLa Porta, EPetrillo, PRadaelli, SRadice, LRaveglia, LFSantoro, EScudellaro, RScarpitta, FCerri, AMenegon, SDondio, GMRizzi, AArmani, EAmari, GCivelli, MVilletti, GPatacchini, RBergamaschi, MBassani, FDelcanale, MImbimbo, BP Discovery of diaryl imidazolidin-2-one derivatives, a novel class of muscarinic M3 selective antagonists (Part 2). J Med Chem 50:1693-7 (2007)  
Target
Name:
Muscarinic acetylcholine receptor M3
Synonyms:
ACM3_HUMAN Cholinergic, muscarinic M3 Muscarinic receptor M3 | RecName: Full=Muscarinic acetylcholine receptor M3
Type:
Enzyme
Mol. Mass.:
66151.03
Organism:
Homo sapiens (Human)
Description:
P20309
Residue:
590
  
Inhibitor
Name:
BDBM50208051
Synonyms:
1-methyl-3-(R)-3-[4,4-bis-(4-fluoro-phenyl)-2-oxo-imidazolidin-1-yl]-1-(2-oxo-2-phenyl-ethyl)-pyrrolidinium | CHEMBL374513
Type:
Small organic molecule
Emp. Form.:
C28H28F2N3O2
Mol. Mass.:
476.5371
SMILES:
C[N+]1(CC(=O)c2ccccc2)CC[C@H](C1)N1CC(NC1=O)(c1ccc(F)cc1)c1ccc(F)cc1
: