Target
Muscarinic acetylcholine receptor M2
Ligand
BDBM50208058
Substrate
Meas. Tech.
ChEMBL_429186 (CHEMBL913820)
Ki
31.5±n/a nM
Citation
 Peretto, IFossati, CGiardina, GAGiardini, AGuala, MLa Porta, EPetrillo, PRadaelli, SRadice, LRaveglia, LFSantoro, EScudellaro, RScarpitta, FCerri, AMenegon, SDondio, GMRizzi, AArmani, EAmari, GCivelli, MVilletti, GPatacchini, RBergamaschi, MBassani, FDelcanale, MImbimbo, BP Discovery of diaryl imidazolidin-2-one derivatives, a novel class of muscarinic M3 selective antagonists (Part 2). J Med Chem 50:1693-7 (2007)  
Target
Name:
Muscarinic acetylcholine receptor M2
Synonyms:
ACM2_HUMAN Cholinergic, muscarinic M2 Muscarinic acetylcholine receptor M2 and M5 | RecName: Full=Muscarinic acetylcholine receptor M2
Type:
GPCR
Mol. Mass.:
51730.61
Organism:
Homo sapiens (Human)
Description:
P08172
Residue:
466
  
Inhibitor
Name:
BDBM50208058
Synonyms:
1-methyl-3-(2-oxo-4,4-diphenyl-imidazolidin-1-yl)-1-(2-oxo-2-phenyl-ethyl)-pyrrolidinium | CHEMBL222636
Type:
Small organic molecule
Emp. Form.:
C28H30N3O2
Mol. Mass.:
440.5562
SMILES:
C[N+]1(CC(=O)c2ccccc2)CCC(C1)N1CC(NC1=O)(c1ccccc1)c1ccccc1
: