Target
Hydroxycarboxylic acid receptor 3
Ligand
BDBM50208115
Substrate
Meas. Tech.
ChEMBL_429282 (CHEMBL915841)
EC50
4900±n/a nM
Citation
 Jung, JKJohnson, BRDuong, TDecaire, MUy, JGharbaoui, TBoatman, PDSage, CRChen, RRichman, JGConnolly, DTSemple, G Analogues of acifran: agonists of the high and low affinity niacin receptors, GPR109a and GPR109b. J Med Chem 50:1445-8 (2007)  
Target
Name:
Hydroxycarboxylic acid receptor 3
Synonyms:
G-protein coupled receptor 109B G-protein coupled receptor HM74B HCA3 HCAR3_HUMAN HM74B NIACR2 Nicotinic acid receptor 2
Type:
Enzyme Catalytic Domain
Mol. Mass.:
44498.06
Organism:
Homo sapiens (Human)
Description:
GPR109B 0 HUMAN::P49019
Residue:
387
  
Inhibitor
Name:
BDBM50208115
Synonyms:
(+)-5-(3-bromo-phenyl)-5-methyl-4-oxo-4,5-dihydro-furan-2-carboxylic acid 5-(3-bromo-phenyl)-5-methyl-4-oxo-4,5-dihydro-furan-2-carboxylic acid | CHEMBL219980
Type:
Small organic molecule
Emp. Form.:
C12H9BrO4
Mol. Mass.:
297.101
SMILES:
CC1(OC(=CC1=O)C(O)=O)c1cccc(Br)c1
: