Target
Chymase
Ligand
BDBM50208219
Substrate
Meas. Tech.
ChEMBL_429291 (CHEMBL915852)
IC50
280±n/a nM
Citation
 Greco, MNHawkins, MJPowell, ETAlmond, HRde Garavilla, LHall, JMinor, LKWang, YCorcoran, TWDi Cera, ECantwell, AMSavvides, SNDamiano, BPMaryanoff, BE Discovery of potent, selective, orally active, nonpeptide inhibitors of human mast cell chymase. J Med Chem 50:1727-30 (2007)  
Target
Name:
Chymase
Synonyms:
Alpha-chymase CMA1_HUMAN CYM Mast cell protease I
Type:
Enzyme
Mol. Mass.:
27340.12
Organism:
Homo sapiens (Human)
Description:
Residue:
247
  
Inhibitor
Name:
BDBM50208219
Synonyms:
(E)-2-(4-methoxystyrylamino)-1-(5-chlorobenzo[b]thiophen-3-yl)-2-oxoethylphosphonic acid | CHEMBL223014
Type:
Small organic molecule
Emp. Form.:
C19H17ClNO5PS
Mol. Mass.:
437.834
SMILES:
COc1ccc(C=CNC(=O)C(c2csc3ccc(Cl)cc23)P(O)(O)=O)cc1
: