Target
Chymase
Ligand
BDBM50208244
Substrate
Meas. Tech.
ChEMBL_429291 (CHEMBL915852)
IC50
16±n/a nM
Citation
 Greco, MNHawkins, MJPowell, ETAlmond, HRde Garavilla, LHall, JMinor, LKWang, YCorcoran, TWDi Cera, ECantwell, AMSavvides, SNDamiano, BPMaryanoff, BE Discovery of potent, selective, orally active, nonpeptide inhibitors of human mast cell chymase. J Med Chem 50:1727-30 (2007)  
Target
Name:
Chymase
Synonyms:
Alpha-chymase CMA1_HUMAN CYM Mast cell protease I
Type:
Enzyme
Mol. Mass.:
27340.12
Organism:
Homo sapiens (Human)
Description:
Residue:
247
  
Inhibitor
Name:
BDBM50208244
Synonyms:
(E)-2-(4-fluorostyrylamino)-1-(5-chloro-1-methyl-1H-indol-3-yl)-2-oxoethylphosphonic acid | CHEMBL373899
Type:
Small organic molecule
Emp. Form.:
C19H17ClFN2O4P
Mol. Mass.:
422.774
SMILES:
Cn1cc(C(C(=O)NC=Cc2ccc(F)cc2)P(O)(O)=O)c2cc(Cl)ccc12
: