Target
Serine-protein kinase ATM
Ligand
BDBM50208517
Substrate
Meas. Tech.
ChEMBL_429365 (CHEMBL916757)
IC50
13±n/a nM
Citation
 Hollick, JJRigoreau, LJCano-Soumillac, CCockcroft, XCurtin, NJFrigerio, MGolding, BTGuiard, SHardcastle, IRHickson, IHummersone, MGMenear, KAMartin, NMMatthews, INewell, DROrd, RRichardson, CJSmith, GCGriffin, RJ Pyranone, thiopyranone, and pyridone inhibitors of phosphatidylinositol 3-kinase related kinases. Structure-activity relationships for DNA-dependent protein kinase inhibition, and identification of the first potent and selective inhibitor of the ataxia telangiectasia mutated kinase. J Med Chem 50:1958-72 (2007)  
Target
Name:
Serine-protein kinase ATM
Synonyms:
A-T mutated ATM_HUMAN | Ataxia telangiectasia mutated
Type:
Protein
Mol. Mass.:
350696.72
Organism:
Homo sapiens (Human)
Description:
Q13315
Residue:
3056
  
Inhibitor
Name:
BDBM50208517
Synonyms:
2-morpholin-4-yl-6-thianthren-1-yl-pyran-4-one KU-55933
Type:
Small organic molecule
Emp. Form.:
C21H17NO3S2
Mol. Mass.:
395.495
SMILES:
O=c1cc(oc(c1)-c1cccc2Sc3ccccc3Sc12)N1CCOCC1
: