Target
Serine-protein kinase ATM
Ligand
BDBM50208543
Substrate
Meas. Tech.
ChEMBL_429365 (CHEMBL916757)
IC50
4300±n/a nM
Citation
 Hollick, JJRigoreau, LJCano-Soumillac, CCockcroft, XCurtin, NJFrigerio, MGolding, BTGuiard, SHardcastle, IRHickson, IHummersone, MGMenear, KAMartin, NMMatthews, INewell, DROrd, RRichardson, CJSmith, GCGriffin, RJ Pyranone, thiopyranone, and pyridone inhibitors of phosphatidylinositol 3-kinase related kinases. Structure-activity relationships for DNA-dependent protein kinase inhibition, and identification of the first potent and selective inhibitor of the ataxia telangiectasia mutated kinase. J Med Chem 50:1958-72 (2007)  
Target
Name:
Serine-protein kinase ATM
Synonyms:
A-T mutated ATM_HUMAN | Ataxia telangiectasia mutated
Type:
Protein
Mol. Mass.:
350696.72
Organism:
Homo sapiens (Human)
Description:
Q13315
Residue:
3056
  
Inhibitor
Name:
BDBM50208543
Synonyms:
6-(4-benzo[b]thiophen-3-ylphenyl)-2-morpholin-4-yl-4H-thiopyran-4-one | CHEMBL374930
Type:
Small organic molecule
Emp. Form.:
C17H15NO3S
Mol. Mass.:
313.371
SMILES:
O=c1cc(oc(c1)-c1csc2ccccc12)N1CCOCC1
: