Target
Cathepsin S
Ligand
BDBM50208836
Substrate
Meas. Tech.
ChEMBL_443352 (CHEMBL893600)
IC50
1.9±n/a nM
Citation
 Bekkali, YThomson, DSBetageri, REmmanuel, MJHao, MHHickey, ELiu, WPatel, UWard, YDYoung, ERNelson, RKukulka, ABrown, MLCrane, KWhite, DFreeman, DMLabadia, MEWildeson, JSpero, DM Identification of a novel class of succinyl-nitrile-based Cathepsin S inhibitors. Bioorg Med Chem Lett 17:2465-9 (2007)  
Target
Name:
Cathepsin S
Synonyms:
CATS_HUMAN Cathepsin S (Cat S) | cathepsin S preproprotein
Type:
Protein
Mol. Mass.:
37507.38
Organism:
Homo sapiens (Human)
Description:
P25774
Residue:
331
  
Inhibitor
Name:
BDBM50208836
Synonyms:
(R)-N-((R)-3-cyano-1-cyclohexylpyrrolidin-3-yl)-4-morpholino-4-oxo-2-((1,2,3,4-tetrahydronaphthalen-2-yl)methyl)butanamide | CHEMBL234912
Type:
Small organic molecule
Emp. Form.:
C30H42N4O3
Mol. Mass.:
506.6795
SMILES:
O=C(C[C@@H](CC1CCc2ccccc2C1)C(=O)N[C@@]1(CCN(C1)C1CCCCC1)C#N)N1CCOCC1
: