Target
Baculoviral IAP repeat-containing protein 5
Ligand
BDBM50209188
Substrate
Meas. Tech.
ChEMBL_443470 (CHEMBL893728)
Kd
75000±n/a nM
Citation
 Wendt, MDSun, CKunzer, ASauer, DSarris, KHoff, EYu, LNettesheim, DGChen, JJin, SComess, KMFan, YAnderson, SNIsaac, BOlejniczak, ETHajduk, PJRosenberg, SHElmore, SW Discovery of a novel small molecule binding site of human survivin. Bioorg Med Chem Lett 17:3122-9 (2007)  
Target
Name:
Baculoviral IAP repeat-containing protein 5
Synonyms:
API4 Apoptosis inhibitor survivin BIRC5_HUMAN | IAP4
Type:
PROTEIN
Mol. Mass.:
16386.52
Organism:
Homo sapiens (Human)
Description:
ChEMBL_443470
Residue:
142
  
Inhibitor
Name:
BDBM50209188
Synonyms:
6-(2-Hydroxy-phenyl)-2-oxo-4-phenyl-1,2-dihydro-pyridine-3-carbonitrile CHEMBL441913
Type:
Small organic molecule
Emp. Form.:
C18H12N2O2
Mol. Mass.:
288.3001
SMILES:
Oc1ccccc1-c1cc(-c2ccccc2)c(C#N)c(=O)[nH]1
: