Target
Baculoviral IAP repeat-containing protein 5
Ligand
BDBM50209205
Substrate
Meas. Tech.
ChEMBL_443470 (CHEMBL893728)
Kd
130000±n/a nM
Citation
 Wendt, MDSun, CKunzer, ASauer, DSarris, KHoff, EYu, LNettesheim, DGChen, JJin, SComess, KMFan, YAnderson, SNIsaac, BOlejniczak, ETHajduk, PJRosenberg, SHElmore, SW Discovery of a novel small molecule binding site of human survivin. Bioorg Med Chem Lett 17:3122-9 (2007)  
Target
Name:
Baculoviral IAP repeat-containing protein 5
Synonyms:
API4 Apoptosis inhibitor survivin BIRC5_HUMAN | IAP4
Type:
PROTEIN
Mol. Mass.:
16386.52
Organism:
Homo sapiens (Human)
Description:
ChEMBL_443470
Residue:
142
  
Inhibitor
Name:
BDBM50209205
Synonyms:
CHEMBL277554 | N-(4-methylpyridin-2-yl)piperidine-4-carboxamide
Type:
Small organic molecule
Emp. Form.:
C12H17N3O
Mol. Mass.:
219.2829
SMILES:
Cc1ccnc(NC(=O)C2CCNCC2)c1
: