Target
Baculoviral IAP repeat-containing protein 5
Ligand
BDBM50209206
Substrate
Meas. Tech.
ChEMBL_443470 (CHEMBL893728)
Kd
8000±n/a nM
Citation
 Wendt, MDSun, CKunzer, ASauer, DSarris, KHoff, EYu, LNettesheim, DGChen, JJin, SComess, KMFan, YAnderson, SNIsaac, BOlejniczak, ETHajduk, PJRosenberg, SHElmore, SW Discovery of a novel small molecule binding site of human survivin. Bioorg Med Chem Lett 17:3122-9 (2007)  
Target
Name:
Baculoviral IAP repeat-containing protein 5
Synonyms:
API4 Apoptosis inhibitor survivin BIRC5_HUMAN | IAP4
Type:
PROTEIN
Mol. Mass.:
16386.52
Organism:
Homo sapiens (Human)
Description:
ChEMBL_443470
Residue:
142
  
Inhibitor
Name:
BDBM50209206
Synonyms:
(2-ethylbenzofuran-3-yl)(4-hydroxy-3,5-diiodophenyl)methanone US9725430, Compound 1c | US9962362, Compound 1c
Type:
Small organic molecule
Emp. Form.:
C17H12I2O3
Mol. Mass.:
518.0843
SMILES:
CCc1oc2ccccc2c1C(=O)c1cc(I)c(O)c(I)c1
: