Target
Receptor tyrosine-protein kinase erbB-2
Ligand
BDBM50209349
Substrate
Meas. Tech.
ChEMBL_438576 (CHEMBL887681)
IC50
75±n/a nM
Citation
 Lippa, BKauffman, GSArcari, JKwan, TChen, JHungerford, WBhattacharya, SZhao, XWilliams, CXiao, JPustilnik, LSu, CMoyer, JDMa, LCampbell, MSteyn, S The discovery of highly selective erbB2 (Her2) inhibitors for the treatment of cancer. Bioorg Med Chem Lett 17:3081-6 (2007)  
Target
Name:
Receptor tyrosine-protein kinase erbB-2
Synonyms:
2.7.10.1 CD_antigen=CD340 ERBB2_HUMAN FASN/HER2 HER2 MLN19 NEU Proto-oncogene Neu Tyrosine kinase-type cell surface receptor HER2 | p185erbB2
Type:
Mol. Mass.:
137894.47
Organism:
Homo sapiens (Human)
Description:
P04626
Residue:
1255
  
Inhibitor
Name:
BDBM50209349
Synonyms:
CHEMBL396287 | N-[3-(4-{4-[1-(3-Chloro-benzoyl)-piperidin-4-yloxy]-3-methyl-phenylamino}-quinazolin-6-yl)-prop-2-ynyl]-2-methoxy-acetamide
Type:
Small organic molecule
Emp. Form.:
C33H32ClN5O4
Mol. Mass.:
598.091
SMILES:
COCC(=O)NCC#Cc1ccc2ncnc(Nc3ccc(OC4CCN(CC4)C(=O)c4cccc(Cl)c4)c(C)c3)c2c1
: