Target
P2Y purinoceptor 14
Ligand
BDBM50209669
Substrate
Meas. Tech.
ChEMBL_434326 (CHEMBL917907)
EC50
49±n/a nM
Citation
 Ko, HFricks, IIvanov, AAHarden, TKJacobson, KA Structure-activity relationship of uridine 5'-diphosphoglucose analogues as agonists of the human P2Y14 receptor. J Med Chem 50:2030-9 (2007)  
Target
Name:
P2Y purinoceptor 14
Synonyms:
GPR105 KIAA0001 P2Y14_HUMAN | Purinergic receptor P2Y14
Type:
PROTEIN
Mol. Mass.:
38991.62
Organism:
Homo sapiens (Human)
Description:
ChEMBL_1502487
Residue:
338
  
Inhibitor
Name:
BDBM50209669
Synonyms:
CHEMBL228111 diphosphoric acid 1-alpha-D-glucopyranosyl ester 2-((2'thio)uridin-5''-yl) ester
Type:
Small organic molecule
Emp. Form.:
C15H24N2O16P2S
Mol. Mass.:
582.367
SMILES:
OC[C@H]1O[C@H](OP(O)(=O)OP(O)(=O)OC[C@H]2O[C@H]([C@H](O)[C@@H]2O)n2ccc(=O)[nH]c2=S)[C@H](O)[C@@H](O)[C@@H]1O
: