Target
B1 bradykinin receptor
Ligand
BDBM50209734
Substrate
Meas. Tech.
ChEMBL_434360 (CHEMBL919419)
Ki
77.6±n/a nM
Citation
 Biswas, KLi, AChen, JJD'Amico, DCFotsch, CHan, NHuman, JLiu, QNorman, MHRiahi, BYuan, CSuzuki, HMareska, DAZhan, JClarke, DEToro, AGroneberg, RDBurgess, LELester-Zeiner, DBiddlecome, GManning, BHArik, LDong, HHuang, MKamassah, ALoeloff, RSun, HHsieh, FYKumar, GNg, GYHungate, RWAskew, BCJohnson, E Potent nonpeptide antagonists of the bradykinin B1 receptor: structure-activity relationship studies with novel diaminochroman carboxamides. J Med Chem 50:2200-12 (2007)  
Target
Name:
B1 bradykinin receptor
Synonyms:
B1 BRADYKININ B1R BK-1 receptor BRADYB1 | Bradykinin B1 receptor
Type:
Enzyme
Mol. Mass.:
40508.87
Organism:
Homo sapiens (Human)
Description:
P46663
Residue:
353
  
Inhibitor
Name:
BDBM50209734
Synonyms:
(R)-N-((R)-7-((tert-butylamino)methyl)chroman-4-yl)-3-phenyl-3-(4-(trifluoromethyl)phenylsulfonamido)propanamide | CHEMBL389054
Type:
Small organic molecule
Emp. Form.:
C30H34F3N3O4S
Mol. Mass.:
589.669
SMILES:
CC(C)(C)NCc1ccc2[C@@H](CCOc2c1)NC(=O)C[C@@H](NS(=O)(=O)c1ccc(cc1)C(F)(F)F)c1ccccc1
: