Target
B1 bradykinin receptor
Ligand
BDBM50209743
Substrate
Meas. Tech.
ChEMBL_434360 (CHEMBL919419)
Ki
3.7±n/a nM
Citation
 Biswas, KLi, AChen, JJD'Amico, DCFotsch, CHan, NHuman, JLiu, QNorman, MHRiahi, BYuan, CSuzuki, HMareska, DAZhan, JClarke, DEToro, AGroneberg, RDBurgess, LELester-Zeiner, DBiddlecome, GManning, BHArik, LDong, HHuang, MKamassah, ALoeloff, RSun, HHsieh, FYKumar, GNg, GYHungate, RWAskew, BCJohnson, E Potent nonpeptide antagonists of the bradykinin B1 receptor: structure-activity relationship studies with novel diaminochroman carboxamides. J Med Chem 50:2200-12 (2007)  
Target
Name:
B1 bradykinin receptor
Synonyms:
B1 BRADYKININ B1R BK-1 receptor BRADYB1 | Bradykinin B1 receptor
Type:
Enzyme
Mol. Mass.:
40508.87
Organism:
Homo sapiens (Human)
Description:
P46663
Residue:
353
  
Inhibitor
Name:
BDBM50209743
Synonyms:
(R)-N-((R)-7-(morpholinomethyl)chroman-4-yl)-3-(naphthalene-3-sulfonamido)-3-phenylpropanamide | CHEMBL412762
Type:
Small organic molecule
Emp. Form.:
C33H35N3O5S
Mol. Mass.:
585.713
SMILES:
O=C(C[C@@H](NS(=O)(=O)c1ccc2ccccc2c1)c1ccccc1)N[C@@H]1CCOc2cc(CN3CCOCC3)ccc12
: