Target
Histamine H3 receptor
Ligand
BDBM50209802
Substrate
Meas. Tech.
ChEMBL_455315 (CHEMBL886091)
Ki
0.6±n/a nM
Citation
 Stocking, EMMiller, JMBarbier, AJWilson, SJBoggs, JDMcAllister, HMWu, JLovenberg, TWCarruthers, NIWolin, RL Synthesis and biological evaluation of diamine-based histamine H3 antagonists with serotonin reuptake inhibitor activity. Bioorg Med Chem Lett 17:3130-5 (2007)  
Target
Name:
Histamine H3 receptor
Synonyms:
G-protein coupled receptor 97 HH3R HRH3 Histamine H3 receptor (H3) Histamine receptor (H3 and H4)
Type:
G Protein-Coupled Receptor (GPCR)
Mol. Mass.:
48691.47
Organism:
Homo sapiens (Human)
Description:
Binding assays were using CHO cells stably expressing hH3R receptors.
Residue:
445
  
Inhibitor
Name:
BDBM50209802
Synonyms:
CHEMBL438490 | N,N-dimethyl-3-phenoxy-3-(4-(3-(piperidin-1-yl)propoxy)phenyl)propan-1-amine
Type:
Small organic molecule
Emp. Form.:
C25H36N2O2
Mol. Mass.:
396.5655
SMILES:
CN(C)CCC(Oc1ccccc1)c1ccc(OCCCN2CCCCC2)cc1
: