Target
Amyloid-beta precursor protein
Ligand
BDBM50196898
Substrate
Meas. Tech.
ChEMBL_438619 (CHEMBL888950)
IC50
16±n/a nM
Citation
 Guo, TGu, HHobbs, DWRokosz, LLStauffer, TMJacob, BClader, JW Design, synthesis, and evaluation of tetrahydroquinoline and pyrrolidine sulfonamide carbamates as gamma-secretase inhibitors. Bioorg Med Chem Lett 17:3010-3 (2007)  
Target
Name:
Amyloid-beta precursor protein
Synonyms:
A4 ABPP AICD-50 AICD-59 AID(57) APP Alzheimer disease amyloid protein Amyloid beta Protein Amyloid beta protein Abeta(1-42) Amyloid intracellular domain 57 Amyloid protein (Abeta42b) Beta amyloid A4 protein Beta-APP42 Beta-amyloid protein 42 C83 CVAP Gamma Secretase Gamma-CTF(57) Gamma-secretase Gamma-secretase C-terminal fragment 57 P3(40) PN-II Protease nexin-II S-APP-beta Soluble APP-beta | beta-Amyloid Precursor Protein (APP)
Type:
Single-pass type I membrane protein
Mol. Mass.:
86890.41
Organism:
Homo sapiens (Human)
Description:
P05067
Residue:
770
  
Inhibitor
Name:
BDBM50196898
Synonyms:
((2R,6S)-1-(4-chlorophenylsulfonyl)-6-phenylpiperidin-2-yl)methyl 4-(piperidin-1-yl)piperidine-1-carboxylate CHEMBL396543
Type:
Small organic molecule
Emp. Form.:
C29H38ClN3O4S
Mol. Mass.:
560.148
SMILES:
Clc1ccc(cc1)S(=O)(=O)N1[C@@H](COC(=O)N2CCC(CC2)N2CCCCC2)CCC[C@H]1c1ccccc1
: