Target
5-hydroxytryptamine receptor 2A
Ligand
BDBM50210085
Substrate
Meas. Tech.
ChEMBL_443937 (CHEMBL893103)
EC50
49.2±n/a nM
Citation
 Feng, ZMohapatra, SKlimko, PGHellberg, MRMay, JAKelly, CWilliams, GMcLaughlin, MASharif, NA Novel benzodifuran analogs as potent 5-HT2A receptor agonists with ocular hypotensive activity. Bioorg Med Chem Lett 17:2998-3002 (2007)  
Target
Name:
5-hydroxytryptamine receptor 2A
Synonyms:
5-HT-2A 5-HT2A 5-hydroxytryptamine receptor 2A (5HT2A) Htr2 Serotonin Receptor 2A
Type:
G Protein-Coupled Receptor (GPCR)
Mol. Mass.:
52852.05
Organism:
Rattus norvegicus (rat)
Description:
Rat cortex membranes 5-HT2A receptors.
Residue:
471
  
Inhibitor
Name:
BDBM50210085
Synonyms:
(R)-1-methyl-2-[8-(3-methyl-[1,2,4]oxadiazol-5-ylmethyl)-2,3,6,7-tetrahydro-benzo[1,2-b;4,5-b']difuran-4-yl]-ethylamine | CHEMBL234837
Type:
Small organic molecule
Emp. Form.:
C17H21N3O3
Mol. Mass.:
315.3669
SMILES:
C[C@@H](N)Cc1c2CCOc2c(Cc2nc(C)no2)c2CCOc12
: