Target
5-hydroxytryptamine receptor 2C
Ligand
BDBM50210084
Substrate
Meas. Tech.
ChEMBL_443939 (CHEMBL893105)
EC50
82±n/a nM
Citation
 Feng, ZMohapatra, SKlimko, PGHellberg, MRMay, JAKelly, CWilliams, GMcLaughlin, MASharif, NA Novel benzodifuran analogs as potent 5-HT2A receptor agonists with ocular hypotensive activity. Bioorg Med Chem Lett 17:2998-3002 (2007)  
Target
Name:
5-hydroxytryptamine receptor 2C
Synonyms:
5-HT2C 5-hydroxytryptamine receptor 2C (5HT2c) 5ht1c Htr2c Serotonin receptor 2a and 2c (5HT2A and 5HT2C)
Type:
Enzyme
Mol. Mass.:
51935.10
Organism:
Rattus norvegicus (Rat)
Description:
P08909
Residue:
460
  
Inhibitor
Name:
BDBM50210084
Synonyms:
(R)-1-methyl-2-[8-(3-methyl-[1,2,4]oxadiazol-5-ylmethyl)-benzo[1,2-b;4,5-b']difuran-4-yl]-ethylamine | CHEMBL234682
Type:
Small organic molecule
Emp. Form.:
C17H17N3O3
Mol. Mass.:
311.3352
SMILES:
C[C@@H](N)Cc1c2ccoc2c(Cc2nc(C)no2)c2ccoc12
: