Target
Nociceptin receptor
Ligand
BDBM50210242
Substrate
Meas. Tech.
ChEMBL_443964 (CHEMBL892111)
Ki
0.500000±n/a nM
Citation
 Ho, GDBercovici, ATulshian, DGreenlee, WJFawzi, AFernandez, XMcLeod, RLSmith Torhan, AZhang, H Synthesis and structure-activity relationships of 4-hydroxy-4-phenylpiperidines as nociceptin receptor ligands: Part 2. Bioorg Med Chem Lett 17:3028-33 (2007)  
Target
Name:
Nociceptin receptor
Synonyms:
KOR-3 Mu-type opioid receptor (Mu) Nociceptin Receptor (ORL1 Receptor) Nociceptin receptor (ORL-1) Nociceptin/Orphanin FQ, NOP receptor OPIATE ORL-1 OPRL1 protein ORL1 Opioid receptor like-1 Orphanin FQ receptor (ORL1) | P41146
Type:
G Protein-Coupled Receptor (GPCR)
Mol. Mass.:
40702.87
Organism:
Homo sapiens (Human)
Description:
P41146
Residue:
370
  
Inhibitor
Name:
BDBM50210242
Synonyms:
4-(2-(aminomethyl)phenyl)-1-(bis(2-fluorophenyl)methyl)piperidin-4-ol | CHEMBL233955
Type:
Small organic molecule
Emp. Form.:
C25H26F2N2O
Mol. Mass.:
408.4835
SMILES:
NCc1ccccc1C1(O)CCN(CC1)C(c1ccccc1F)c1ccccc1F
: