Target
Neuropeptide Y receptor type 5
Ligand
BDBM50210327
Substrate
Meas. Tech.
ChEMBL_434575 (CHEMBL914222)
Ki
>1000±n/a nM
Citation
 Lumb, KJDeCarr, LBMilardo, LFMays, MRBuckholz, TMFisk, SEPellegrino, CMOrtiz, AAMahle, CD Novel selective neuropeptide Y2 receptor PEGylated peptide agonists reduce food intake and body weight in mice. J Med Chem 50:2264-8 (2007)  
Target
Name:
Neuropeptide Y receptor type 5
Synonyms:
NPY-Y5 NPY5-R NPY5R_HUMAN NPYY5 Neuropeptide Y receptor type 5 ( NPY Y5) | Y5 receptor
Type:
Enzyme
Mol. Mass.:
50746.64
Organism:
Homo sapiens (Human)
Description:
Q15761
Residue:
445
  
Inhibitor
Name:
BDBM50210327
Synonyms:
(2S)-N-[(1S)-4-carbamimidamido-1-{[(1S)-1-carbamoyl-2-(4-hydroxyphenyl)ethyl]carbamoyl}butyl]-2-[(2S)-5-carbamimidamido-2-[(2S,3R)-2-[(2S)-2-[(2S)-2-[(2S)-2-[(2S)-2-[(2S)-2-[(2S)-2-[(2S)-5-carbamimidamido-2-{[2-(methylsulfanyl)pyridin-3-yl]formamido}pentanamido]-3-(1H-imidazol-5-yl)propanamido]-3-(4-hydroxyphenyl)propanamido]-4-methylpentanamido]-3-carbamoylpropanamido]-4-methylpentanamido]-4-methylpentanamido]-3-hydroxybutanamido]pentanamido]pentanediamide | CHEMBL437487
Type:
Small organic molecule
Emp. Form.:
C80H123N27O18S
Mol. Mass.:
1783.068
SMILES:
CSc1ncccc1C(=O)N[C@@H](CCCN=C(N)N)C(=O)N[C@@H](Cc1cnc[nH]1)C(=O)N[C@@H](Cc1ccc(O)cc1)C(=O)N[C@@H](CC(C)C)C(=O)N[C@@H](CC(N)=O)C(=O)N[C@@H](CC(C)C)C(=O)N[C@@H](CC(C)C)C(=O)N[C@@H]([C@@H](C)O)C(=O)N[C@@H](CCCN=C(N)N)C(=O)N[C@@H](CCC(N)=O)C(=O)N[C@@H](CCCN=C(N)N)C(=O)N[C@@H](Cc1ccc(O)cc1)C(N)=O
: