Target
B1 bradykinin receptor
Ligand
BDBM50210358
Substrate
Meas. Tech.
ChEMBL_443978 (CHEMBL893140)
Ki
1645±n/a nM
Citation
 Su, DSLim, JLMarkowitz, MKWan, BLMurphy, KLReiss, DRHarrell, CMO'Malley, SSRansom, RWChang, RSPettibone, DJTang, CPrueksaritanont, TFreidinger, RMBock, MG Potent bradykinin B1 receptor antagonists: 4-substituted phenyl cyclohexanes. Bioorg Med Chem Lett 17:3006-9 (2007)  
Target
Name:
B1 bradykinin receptor
Synonyms:
B1 BRADYKININ B1R BK-1 receptor BRADYB1 | Bradykinin B1 receptor
Type:
Enzyme
Mol. Mass.:
40508.87
Organism:
Homo sapiens (Human)
Description:
P46663
Residue:
353
  
Inhibitor
Name:
BDBM50210358
Synonyms:
CHEMBL233873 | methyl 1-phenyl-4-((3-(3,3,3-trifluoropropanamido)pyridin-2-ylamino)methyl)cyclohexanecarboxylate
Type:
Small organic molecule
Emp. Form.:
C23H26F3N3O3
Mol. Mass.:
449.466
SMILES:
COC(=O)C1(CCC(CNc2ncccc2NC(=O)CC(F)(F)F)CC1)c1ccccc1
: