Target
B1 bradykinin receptor
Ligand
BDBM50210362
Substrate
Meas. Tech.
ChEMBL_443978 (CHEMBL893140)
Ki
30±n/a nM
Citation
 Su, DSLim, JLMarkowitz, MKWan, BLMurphy, KLReiss, DRHarrell, CMO'Malley, SSRansom, RWChang, RSPettibone, DJTang, CPrueksaritanont, TFreidinger, RMBock, MG Potent bradykinin B1 receptor antagonists: 4-substituted phenyl cyclohexanes. Bioorg Med Chem Lett 17:3006-9 (2007)  
Target
Name:
B1 bradykinin receptor
Synonyms:
B1 BRADYKININ B1R BK-1 receptor BRADYB1 | Bradykinin B1 receptor
Type:
Enzyme
Mol. Mass.:
40508.87
Organism:
Homo sapiens (Human)
Description:
P46663
Residue:
353
  
Inhibitor
Name:
BDBM50210362
Synonyms:
CHEMBL234514 | N-(2-((4-cyano-4-(3,4-dichlorophenyl)cyclohexyl)methylamino)pyridin-3-yl)-3,3,3-trifluoropropanamide
Type:
Small organic molecule
Emp. Form.:
C22H21Cl2F3N4O
Mol. Mass.:
485.33
SMILES:
FC(F)(F)CC(=O)Nc1cccnc1NCC1CCC(CC1)(C#N)c1ccc(Cl)c(Cl)c1
: