Target
B1 bradykinin receptor
Ligand
BDBM50210370
Substrate
Meas. Tech.
ChEMBL_443978 (CHEMBL893140)
Ki
2±n/a nM
Citation
 Su, DSLim, JLMarkowitz, MKWan, BLMurphy, KLReiss, DRHarrell, CMO'Malley, SSRansom, RWChang, RSPettibone, DJTang, CPrueksaritanont, TFreidinger, RMBock, MG Potent bradykinin B1 receptor antagonists: 4-substituted phenyl cyclohexanes. Bioorg Med Chem Lett 17:3006-9 (2007)  
Target
Name:
B1 bradykinin receptor
Synonyms:
B1 BRADYKININ B1R BK-1 receptor BRADYB1 | Bradykinin B1 receptor
Type:
Enzyme
Mol. Mass.:
40508.87
Organism:
Homo sapiens (Human)
Description:
P46663
Residue:
353
  
Inhibitor
Name:
BDBM50210370
Synonyms:
CHEMBL388031 | N-(2-((4-cyano-4-(2,3-difluorophenyl)cyclohexyl)methylamino)pyridin-3-yl)-3,3,3-trifluoropropanamide
Type:
Small organic molecule
Emp. Form.:
C22H21F5N4O
Mol. Mass.:
452.4204
SMILES:
Fc1cccc(c1F)C1(CCC(CNc2ncccc2NC(=O)CC(F)(F)F)CC1)C#N
: