Target
5-hydroxytryptamine receptor 1A
Ligand
BDBM50210641
Substrate
Meas. Tech.
ChEMBL_444108 (CHEMBL892234)
Ki
307±n/a nM
Citation
 Bueno, ABGilmore, JBoot, JBroadmore, RCooper, JFindlay, JHayhurst, LMarcos, AMontero, CMitchell, STimms, GTomlinson, RWallace, LWalton, L Naphthyl piperazines with dual activity as 5-HT1D antagonists and 5-HT reuptake inhibitors. Bioorg Med Chem Lett 17:3344-8 (2007)  
Target
Name:
5-hydroxytryptamine receptor 1A
Synonyms:
5-HT-1A 5-hydroxytryptamine receptor 1A (5-HT-1A) ADRB2RL1 Dopamine D2 receptor and serotonin 1a receptor HTR1A | Serotonin receptor 1A
Type:
Mol. Mass.:
46122.49
Organism:
Homo sapiens (Human)
Description:
Residue:
422
  
Inhibitor
Name:
BDBM50210641
Synonyms:
(S)-1-(2-((S)-4-(6-fluoronaphthalen-2-yl)-2-methylpiperazin-1-yl)ethyl)isochroman-6-carboxamide | CHEMBL391272
Type:
Small organic molecule
Emp. Form.:
C27H30FN3O2
Mol. Mass.:
447.5444
SMILES:
C[C@H]1CN(CCN1CC[C@@H]1OCCc2cc(ccc12)C(N)=O)c1ccc2cc(F)ccc2c1
: