Target
5-hydroxytryptamine receptor 1D
Ligand
BDBM50210641
Substrate
Meas. Tech.
ChEMBL_444103 (CHEMBL893266)
Ki
14±n/a nM
Citation
 Bueno, ABGilmore, JBoot, JBroadmore, RCooper, JFindlay, JHayhurst, LMarcos, AMontero, CMitchell, STimms, GTomlinson, RWallace, LWalton, L Naphthyl piperazines with dual activity as 5-HT1D antagonists and 5-HT reuptake inhibitors. Bioorg Med Chem Lett 17:3344-8 (2007)  
Target
Name:
5-hydroxytryptamine receptor 1D
Synonyms:
5-HT-1D 5-HT1D 5HT1D_HUMAN HTR1DA Serotonin (5-HT) receptor | Serotonin Receptor 1D
Type:
G Protein-Coupled Receptor (GPCR)
Mol. Mass.:
41920.63
Organism:
Homo sapiens (Human)
Description:
Receptor binding assays were performed using human clone stably expressed in CHO cells.
Residue:
377
  
Inhibitor
Name:
BDBM50210641
Synonyms:
(S)-1-(2-((S)-4-(6-fluoronaphthalen-2-yl)-2-methylpiperazin-1-yl)ethyl)isochroman-6-carboxamide | CHEMBL391272
Type:
Small organic molecule
Emp. Form.:
C27H30FN3O2
Mol. Mass.:
447.5444
SMILES:
C[C@H]1CN(CCN1CC[C@@H]1OCCc2cc(ccc12)C(N)=O)c1ccc2cc(F)ccc2c1
: