Target
Beta-secretase 1
Ligand
BDBM50210720
Substrate
Meas. Tech.
ChEMBL_438637 (CHEMBL888968)
IC50
300±n/a nM
Citation
 Kortum, SWBenson, TEBienkowski, MJEmmons, TLPrince, DBPaddock, DJTomasselli, AGMoon, JBLaBorde, ATenBrink, RE Potent and selective isophthalamide S2 hydroxyethylamine inhibitors of BACE1. Bioorg Med Chem Lett 17:3378-83 (2007)  
Target
Name:
Beta-secretase 1
Synonyms:
ASP2 Aspartyl protease 2 BACE1 Beta-secretase (BACE) Beta-secretase 1 (BACE 1) Beta-secretase 1 (BACE1) Beta-site amyloid precursor protein cleaving enzyme 1 Memapsin-2 beta-Secretase (BACE-1) | beta-Secretase (BACE1)
Type:
Protein
Mol. Mass.:
55755.10
Organism:
Homo sapiens (Human)
Description:
P56817
Residue:
501
  
Inhibitor
Name:
BDBM50210720
Synonyms:
CHEMBL397715 | N1-((2S,3R)-4-(3-methoxybenzylamino)-3-hydroxy-1-(4-hydroxyphenyl)butan-2-yl)-N3,N3-dipropylbenzene-1,3,5-tricarboxamide
Type:
Small organic molecule
Emp. Form.:
C33H42N4O6
Mol. Mass.:
590.7098
SMILES:
CCCN(CCC)C(=O)c1cc(cc(c1)C(=O)N[C@@H](Cc1ccc(O)cc1)[C@H](O)CNCc1cccc(OC)c1)C(N)=O
: